Target
Endothelial PAS domain-containing protein 1/Hypoxia-inducible factor 1-alpha
Ligand
BDBM50485671
Substrate
Meas. Tech.
ChEMBL_851301 (CHEMBL2155887)
IC50
200±n/a nM
Citation
 Du, LMahdi, FDatta, SJekabsons, MBZhou, YDNagle, DG Structures and mechanisms of antitumor agents: xestoquinones uncouple cellular respiration and disrupt HIF signaling in human breast tumor cells. J Nat Prod 75:1553-9 (2012)  
Target
Name:
Endothelial PAS domain-containing protein 1/Hypoxia-inducible factor 1-alpha
Synonyms:
Hypoxia inducible factors; HIF-1-alpha, HIF-2-alpha
Type:
Mol. Mass.:
Description:
ASSAY_ID of ChEMBL is 799337
Components:
This complex has 2 components.
Component 1
Name:
Hypoxia-inducible factor 1-alpha
Synonyms:
BHLHE78 HIF-1-alpha, HIF-2-alpha HIF1A_HUMAN Hypoxia-inducible factor 1 alpha MOP1 von Hippel-Lindau disease tumor suppressor/Elongin-C/Elongin-B/HIF1A
Type:
Protein
Mol. Mass.:
92647.24
Organism:
Homo sapiens (Human)
Description:
Q16665
Residue:
826
  
Component 2
Name:
Endothelial PAS domain-containing protein 1
Synonyms:
BHLHE73 EPAS1_HUMAN MOP2 endothelial PAS domain-containing protein 1
Type:
PROTEIN
Mol. Mass.:
96453.58
Organism:
Homo sapiens (Human)
Description:
ChEMBL_1506501
Residue:
870
  
Inhibitor
Name:
BDBM50485671
Synonyms:
ADOCIAQUINONE A | Adociaquinones A
Type:
Small organic molecule
Emp. Form.:
C22H17NO6S
Mol. Mass.:
423.438
SMILES:
C[C@@]12CCCc3coc(c13)C(=O)c1cc3C(O)=C4C(=NCCS4(=O)=O)C(=O)c3cc21
: