Target
Heat shock protein HSP 90-alpha/90-beta
Ligand
BDBM50485825
Substrate
Meas. Tech.
ChEMBL_862455 (CHEMBL2173550)
IC50
100±n/a nM
Citation
 Kim, SHBajji, ATangallapally, RMarkovitz, BTrovato, RShenderovich, MBaichwal, VBartel, PCimbora, DMcKinnon, RRobinson, RPapac, DWettstein, DCarlson, RYager, KM Discovery of (2S)-1-[4-(2-{6-amino-8-[(6-bromo-1,3-benzodioxol-5-yl)sulfanyl]-9H-purin-9-yl}ethyl)piperidin-1-yl]-2-hydroxypropan-1-one (MPC-3100), a purine-based Hsp90 inhibitor. J Med Chem 55:7480-501 (2012)  
Target
Name:
Heat shock protein HSP 90-alpha/90-beta
Synonyms:
Heat Shock Protein 90 (Hsp90) Heat shock protein HSP90
Type:
Mol. Mass.:
Description:
ASSAY_ID of EBI is 29664
Components:
This complex has 2 components.
Component 1
Name:
Heat shock protein HSP 90-alpha
Synonyms:
HS90A_HUMAN HSP86 HSP90AA1 HSPCA Heat shock 86 kDa Heat shock protein HSP 90-alpha (HSP90) LAP-2 Lipopolysaccharide-associated protein 2 heat shock protein 90kDa alpha (cytosolic), class A member 1 isoform 2
Type:
Molecular Chaperone
Mol. Mass.:
84623.45
Organism:
Homo sapiens (Human)
Description:
P07900
Residue:
732
  
Component 2
Name:
Heat shock protein HSP 90-beta
Synonyms:
HS90B_HUMAN HSP 90 HSP90B HSPCB Heat shock protein HSP 90 (Hsp90)
Type:
Molecular Chaperone
Mol. Mass.:
83229.45
Organism:
Homo sapiens (Human)
Description:
P08238
Residue:
724
  
Inhibitor
Name:
BDBM50485825
Synonyms:
CHEMBL2170470
Type:
Small organic molecule
Emp. Form.:
C22H25BrN6O4S
Mol. Mass.:
549.441
SMILES:
C[C@H](O)C(=O)N1CCC(CCn2c(Sc3cc4OCOc4cc3Br)nc3c(N)ncnc23)CC1
: