Target
Neuraminidase
Ligand
BDBM60918
Substrate
Meas. Tech.
ChEMBL_884357 (CHEMBL2210795)
IC50
>100000±n/a nM
Citation
 Liu, KCFang, JMJan, JTCheng, TJWang, SYYang, STCheng, YSWong, CH Enhanced anti-influenza agents conjugated with anti-inflammatory activity. J Med Chem 55:8493-501 (2012)  
Target
Name:
Neuraminidase
Synonyms:
NA | NRAM_I33A0
Type:
PROTEIN
Mol. Mass.:
49687.56
Organism:
Influenza A virus (strain A/Wilson-Smith/1933 H1N1) (Influenza A virus(strain A/WS/1933 H1N1))
Description:
ChEMBL_881601
Residue:
453
  
Inhibitor
Name:
BDBM60918
Synonyms:
5-Amino-2-hydroxy-benzoic acid MLS001424012 cid_4075
Type:
Small organic molecule
Emp. Form.:
C7H7NO3
Mol. Mass.:
153.1354
SMILES:
Nc1ccc(O)c(c1)C(O)=O
: