Target
D(1A) dopamine receptor
Ligand
BDBM50029387
Substrate
Meas. Tech.
ChEMBL_58346 (CHEMBL880016)
IC50
0.76±n/a nM
Citation
 Bøgesø, KPArnt, JFrederiksen, KHansen, HOHyttel, JPedersen, H Enhanced D1 affinity in a series of piperazine ring substituted 1-piperazino-3-arylindans with potential atypical antipsychotic activity. J Med Chem 38:4380-92 (1995)  
Target
Name:
D(1A) dopamine receptor
Synonyms:
DOPAMINE D1 Dopamine D1 high Dopamine receptor Dopamine1-like Drd1a
Type:
Enzyme Catalytic Domain
Mol. Mass.:
49429.75
Organism:
RAT
Description:
P18901
Residue:
446
  
Inhibitor
Name:
BDBM50029387
Synonyms:
4-(6-Chloro-3-thiophen-3-yl-indan-1-yl)-1,2,2-trimethyl-piperazine | CHEMBL136226
Type:
Small organic molecule
Emp. Form.:
C20H25ClN2S
Mol. Mass.:
360.944
SMILES:
CN1CCN(CC1(C)C)C1CC(c2ccsc2)c2ccc(Cl)cc12
: