Target
Neutrophil elastase
Ligand
BDBM50029696
Substrate
Meas. Tech.
ChEMBL_64004 (CHEMBL672345)
Ki
0.027±n/a nM
Citation
 Hlasta, DJAckerman, JHCourt, JJFarrell, RPJohnson, JAKofron, JLRobinson, DTTalomie, TGDunlap, RPFranke, CA A novel class of cyclic beta-dicarbonyl leaving groups and their use in the design of benzisothiazolone human leukocyte elastase inhibitors. J Med Chem 38:4687-92 (1995)  
Target
Name:
Neutrophil elastase
Synonyms:
Bone marrow serine protease Coagulation factor X ELANE Elastase HLE Leukocyte elastase Medullasin Neutrophil elastase (HNE) PMN elastase Trypsin
Type:
Enzyme
Mol. Mass.:
28532.38
Organism:
Homo sapiens (Human)
Description:
P08246
Residue:
267
  
Inhibitor
Name:
BDBM50029696
Synonyms:
2-(3-Benzoyl-6-methyl-2-oxo-2H-pyran-4-yloxymethyl)-4-isopropyl-6-methoxy-1,1-dioxo-1,2-dihydro-1lambda*6*-benzo[d]isothiazol-3-one | CHEMBL356043
Type:
Small organic molecule
Emp. Form.:
C25H23NO8S
Mol. Mass.:
497.517
SMILES:
COc1cc2c(C(=O)N(COc3cc(C)oc(=O)c3C(=O)c3ccccc3)S2(=O)=O)c(c1)C(C)C
: