Target
Neuromedin-K receptor
Ligand
BDBM21016
Substrate
Meas. Tech.
ChEMBL_143198 (CHEMBL747336)
IC50
>5000±n/a nM
Citation
 MacLeod, AMMerchant, KJBrookfield, FKelleher, FStevenson, GOwens, APSwain, CJCasiceri, MASadowski, SBer, E Identification of L-tryptophan derivatives with potent and selective antagonist activity at the NK1 receptor. J Med Chem 37:1269-74 (1994)  
Target
Name:
Neuromedin-K receptor
Synonyms:
NK-3 receptor NK3R NKR Neurokinin B receptor Neuromedin-3 receptor (NK-3R) Neuromedin-K receptor Neuromedin-K receptor (NK3) TAC3R Tachykinin receptor 3 | Tachykinin receptor 3 (NK3)
Type:
Enzyme
Mol. Mass.:
52221.96
Organism:
Homo sapiens (Human)
Description:
P29371
Residue:
465
  
Inhibitor
Name:
BDBM21016
Synonyms:
CHEMBL22870 L-732,138 N-acetyltryptophan 3,5-bis(trifluoromethyl)benzyl ester | [3,5-bis(trifluoromethyl)phenyl]methyl (2S)-2-acetamido-3-(1H-indol-3-yl)propanoate
Type:
Small organic molecule
Emp. Form.:
C22H18F6N2O3
Mol. Mass.:
472.3803
SMILES:
CC(=O)N[C@@H](Cc1c[nH]c2ccccc12)C(=O)OCc1cc(cc(c1)C(F)(F)F)C(F)(F)F
: