Target
Substance-K receptor
Ligand
BDBM21016
Substrate
Meas. Tech.
ChEMBL_143058 (CHEMBL750305)
IC50
>5000±n/a nM
Citation
 MacLeod, AMMerchant, KJBrookfield, FKelleher, FStevenson, GOwens, APSwain, CJCasiceri, MASadowski, SBer, E Identification of L-tryptophan derivatives with potent and selective antagonist activity at the NK1 receptor. J Med Chem 37:1269-74 (1994)  
Target
Name:
Substance-K receptor
Synonyms:
NK-2 receptor NK2R NKNAR Neurokinin A receptor Neurokinin-2 (NK-2) SKR TACR2 Tachykinin receptor 2 (NK2) | hnk-3
Type:
Protein
Mol. Mass.:
44455.78
Organism:
Homo sapiens (Human)
Description:
P21452
Residue:
398
  
Inhibitor
Name:
BDBM21016
Synonyms:
CHEMBL22870 L-732,138 N-acetyltryptophan 3,5-bis(trifluoromethyl)benzyl ester | [3,5-bis(trifluoromethyl)phenyl]methyl (2S)-2-acetamido-3-(1H-indol-3-yl)propanoate
Type:
Small organic molecule
Emp. Form.:
C22H18F6N2O3
Mol. Mass.:
472.3803
SMILES:
CC(=O)N[C@@H](Cc1c[nH]c2ccccc12)C(=O)OCc1cc(cc(c1)C(F)(F)F)C(F)(F)F
: