Target
Acetolactate synthase, chloroplastic
Ligand
BDBM50487036
Substrate
Meas. Tech.
ChEMBL_906554 (CHEMBL3067256)
Ki
1400000±n/a nM
Citation
 Li, YXLuo, YPXi, ZNiu, CHe, YZYang, GF Design and syntheses of novel phthalazin-1(2H)-one derivatives as acetohydroxyacid synthase inhibitors. J Agric Food Chem 54:9135-9 (2006)  
Target
Name:
Acetolactate synthase, chloroplastic
Synonyms:
AHAS Acetolactate synthase ILVB_ARATH | TZP5
Type:
PROTEIN
Mol. Mass.:
72585.19
Organism:
Arabidopsis thaliana
Description:
ChEMBL_934103
Residue:
670
  
Inhibitor
Name:
BDBM50487036
Synonyms:
CHEMBL2253243
Type:
Small organic molecule
Emp. Form.:
C22H19FN4O4
Mol. Mass.:
422.4091
SMILES:
COc1cc(OC)nc(Oc2cccc3c(C)nn(Cc4cccc(F)c4)c(=O)c23)n1
: