Target
Acetolactate synthase, chloroplastic
Ligand
BDBM50487037
Substrate
Meas. Tech.
ChEMBL_906554 (CHEMBL3067256)
Ki
710000±n/a nM
Citation
 Li, YXLuo, YPXi, ZNiu, CHe, YZYang, GF Design and syntheses of novel phthalazin-1(2H)-one derivatives as acetohydroxyacid synthase inhibitors. J Agric Food Chem 54:9135-9 (2006)  
Target
Name:
Acetolactate synthase, chloroplastic
Synonyms:
AHAS Acetolactate synthase ILVB_ARATH | TZP5
Type:
PROTEIN
Mol. Mass.:
72585.19
Organism:
Arabidopsis thaliana
Description:
ChEMBL_934103
Residue:
670
  
Inhibitor
Name:
BDBM50487037
Synonyms:
CHEMBL2253234
Type:
Small organic molecule
Emp. Form.:
C24H22N4O5
Mol. Mass.:
446.4553
SMILES:
CCc1ccc(cc1)C(=O)n1nc(C)c2cccc(Oc3nc(OC)cc(OC)n3)c2c1=O
: