Target
Acetolactate synthase, chloroplastic
Ligand
BDBM50487052
Substrate
Meas. Tech.
ChEMBL_906554 (CHEMBL3067256)
Ki
780000±n/a nM
Citation
 Li, YXLuo, YPXi, ZNiu, CHe, YZYang, GF Design and syntheses of novel phthalazin-1(2H)-one derivatives as acetohydroxyacid synthase inhibitors. J Agric Food Chem 54:9135-9 (2006)  
Target
Name:
Acetolactate synthase, chloroplastic
Synonyms:
AHAS Acetolactate synthase ILVB_ARATH | TZP5
Type:
PROTEIN
Mol. Mass.:
72585.19
Organism:
Arabidopsis thaliana
Description:
ChEMBL_934103
Residue:
670
  
Inhibitor
Name:
BDBM50487052
Synonyms:
CHEMBL2253236
Type:
Small organic molecule
Emp. Form.:
C19H20N4O6
Mol. Mass.:
400.3853
SMILES:
COc1cc(OC)nc(Oc2cccc3c(C)nn(CC4OCCO4)c(=O)c23)n1
: