Target
Acetolactate synthase, chloroplastic
Ligand
BDBM50487168
Substrate
Meas. Tech.
ChEMBL_908731 (CHEMBL3066158)
Ki
18500±n/a nM
Citation
 Chen, CNChen, QLiu, YCZhu, XLNiu, CWXi, ZYang, GF Syntheses and herbicidal activity of new triazolopyrimidine-2-sulfonamides as acetohydroxyacid synthase inhibitor. Bioorg Med Chem 18:4897-904 (2010)  
Target
Name:
Acetolactate synthase, chloroplastic
Synonyms:
AHAS Acetolactate synthase ILVB_ARATH | TZP5
Type:
PROTEIN
Mol. Mass.:
72585.19
Organism:
Arabidopsis thaliana
Description:
ChEMBL_934103
Residue:
670
  
Inhibitor
Name:
BDBM50487168
Synonyms:
CHEMBL2251955
Type:
Small organic molecule
Emp. Form.:
C12H9F2N5O3S
Mol. Mass.:
341.293
SMILES:
COc1ccn2nc(nc2n1)S(=O)(=O)Nc1c(F)cccc1F
: