Target
Acetolactate synthase, chloroplastic
Ligand
BDBM50487183
Substrate
Meas. Tech.
ChEMBL_908731 (CHEMBL3066158)
Ki
>1000000±n/a nM
Citation
 Chen, CNChen, QLiu, YCZhu, XLNiu, CWXi, ZYang, GF Syntheses and herbicidal activity of new triazolopyrimidine-2-sulfonamides as acetohydroxyacid synthase inhibitor. Bioorg Med Chem 18:4897-904 (2010)  
Target
Name:
Acetolactate synthase, chloroplastic
Synonyms:
AHAS Acetolactate synthase ILVB_ARATH | TZP5
Type:
PROTEIN
Mol. Mass.:
72585.19
Organism:
Arabidopsis thaliana
Description:
ChEMBL_934103
Residue:
670
  
Inhibitor
Name:
BDBM50487183
Synonyms:
CHEMBL2251945
Type:
Small organic molecule
Emp. Form.:
C13H7F6N5O2S
Mol. Mass.:
411.282
SMILES:
Cc1nc(cc2nc(nn12)S(=O)(=O)Nc1ccc(F)c(F)c1F)C(F)(F)F
: