Target
Neuronal acetylcholine receptor subunit alpha-4
Ligand
BDBM82070
Substrate
Meas. Tech.
ChEMBL_908844 (CHEMBL3067866)
Ki
1.9±n/a nM
Citation
 Tomizawa, MCasida, JE Unique neonicotinoid binding conformations conferring selective receptor interactions. J Agric Food Chem 59:2825-8 (2011)  
Target
Name:
Neuronal acetylcholine receptor subunit alpha-4
Synonyms:
ACHA4_CHICK | CHRNA4
Type:
PROTEIN
Mol. Mass.:
70849.36
Organism:
Gallus gallus
Description:
ChEMBL_492116
Residue:
622
  
Inhibitor
Name:
BDBM82070
Synonyms:
CAS_29790-52-1 Nicotine-D salicylate US9303017, Nicotine
Type:
Emp. Form.:
C10H14N2
Mol. Mass.:
162.2316
SMILES:
CN1CCC[C@H]1c1cccnc1
: