Target
D(3) dopamine receptor
Ligand
BDBM50487259
Substrate
Meas. Tech.
ChEMBL_910814 (CHEMBL3057570)
Kd
0.060000±n/a nM
Citation
  TBA Med Chem Res 13:25-33 (2004)    Article 
Target
Name:
D(3) dopamine receptor
Synonyms:
DOPAMINE D3 Dopamine D3 receptor | Drd3
Type:
Protein
Mol. Mass.:
49540.58
Organism:
Rattus norvegicus (Rat)
Description:
P19020
Residue:
446
  
Inhibitor
Name:
BDBM50487259
Synonyms:
CHEBI:64219 | [3H]NEMONAPRIDE
Type:
Small organic molecule
Emp. Form.:
C21H26ClN3O2
Mol. Mass.:
387.903
SMILES:
CNc1cc(OC)c(cc1Cl)C(=O)N[C@@H]1CCN(Cc2ccccc2)[C@@H]1C
: