Target
Proteinase-activated receptor 1
Ligand
BDBM50031408
Substrate
Meas. Tech.
ChEMBL_209245 (CHEMBL814872)
EC50
235000±n/a nM
Citation
 Feng, DMVeber, DFConnolly, TMCondra, CTang, MJNutt, RF Development of a potent thrombin receptor ligand. J Med Chem 38:4125-30 (1995)  
Target
Name:
Proteinase-activated receptor 1
Synonyms:
CF2R F2R PAR1 Proteinase activated receptor 1 TR Thrombin receptor/ Proteinase-activated receptor 1(Par-1)
Type:
Protein
Mol. Mass.:
47450.07
Organism:
Homo sapiens (Human)
Description:
P25116
Residue:
425
  
Inhibitor
Name:
BDBM50031408
Synonyms:
(S)-2-[(S)-3-(4-Amino-phenyl)-2-((S)-2-amino-propionylamino)-propionylamino]-4-methyl-pentanoic acid [(S)-1-((S)-1-carbamoyl-4-guanidino-butylcarbamoyl)-3-methyl-butyl]-amide | CHEMBL337852
Type:
Small organic molecule
Emp. Form.:
C30H52N10O5
Mol. Mass.:
632.7979
SMILES:
CC(C)C[C@H](NC(=O)[C@H](CC(C)C)NC(=O)[C@H](Cc1ccc(N)cc1)NC(=O)[C@H](C)N)C(=O)N[C@@H](CCCNC(N)=N)C(N)=O
: