Target
Retinoic acid receptor RXR-alpha
Ligand
BDBM50031457
Substrate
Meas. Tech.
ChEMBL_196765 (CHEMBL797917)
Kd
16±n/a nM
Citation
 Alam, MZhestkov, VSani, BPVenepally, PLevin, AAKazmer, SLi, ENorris, AWZhang, XKLee, MO Conformationally defined 6-s-trans-retinoic acid analogs. 2. Selective agonists for nuclear receptor binding and transcriptional activity. J Med Chem 38:2302-10 (1995)  
Target
Name:
Retinoic acid receptor RXR-alpha
Synonyms:
NR2B1 Nuclear receptor subfamily 4 group A member 2 RXRA Retinoic acid receptor RXR-alpha/gamma Retinoid receptor
Type:
PROTEIN
Mol. Mass.:
50820.38
Organism:
Homo sapiens (Human)
Description:
ChEMBL_1456363
Residue:
462
  
Inhibitor
Name:
BDBM50031457
Synonyms:
(2Z,5E)-3-{(E)-3-[3-Ethyl-2-isopropyl-cyclohex-2-en-(E)-ylidene]-2-methyl-propenyl}-5-methyl-hepta-2,5-dienoic acid | CHEMBL72988
Type:
Small organic molecule
Emp. Form.:
C23H34O2
Mol. Mass.:
342.5149
SMILES:
CCC1=C(C(C)C)\C(CCC1)=C\C(\C)=C\C(\C\C(C)=C\C)=C/C(O)=O
: