Target
Type-1 angiotensin II receptor
Ligand
BDBM50031954
Substrate
Meas. Tech.
ChEMBL_36797 (CHEMBL650317)
Ki
0.45±n/a nM
Citation
 Kiyama, RHonma, THayashi, KOgawa, MHara, MFujimoto, MFujishita, T Novel angiotensin II receptor antagonists. Design, synthesis, and in vitro evaluation of dibenzo[a,d]cycloheptene and dibenzo[b,f]oxepin derivatives. Searching for bioisosteres of biphenylyltetrazole using a three-dimensional search technique. J Med Chem 38:2728-41 (1995)  
Target
Name:
Type-1 angiotensin II receptor
Synonyms:
AGTR1 AGTR1B AT1 AT1BR AT2R1B Angiotensin II receptor Type-1 angiotensin II receptor (AT1)
Type:
Protein
Mol. Mass.:
41080.75
Organism:
Homo sapiens (Human)
Description:
P30556
Residue:
359
  
Inhibitor
Name:
BDBM50031954
Synonyms:
3-(2-Cyclopropyl-5,7-dimethyl-imidazo[4,5-b]pyridin-3-ylmethyl)-11-(1H-tetrazol-5-yl)-dibenzo[a,d]cyclohepten-5-one | CHEMBL93522
Type:
Small organic molecule
Emp. Form.:
C28H23N7O
Mol. Mass.:
473.5285
SMILES:
Cc1cc(C)c2nc(C3CC3)n(Cc3ccc4c(cc5ccccc5c(=O)c4c3)-c3nnn[nH]3)c2n1
: