Target
Dipeptidyl peptidase 3
Ligand
BDBM50174201
Substrate
Meas. Tech.
ChEMBL_913308 (CHEMBL3053565)
IC50
220000±n/a nM
Citation
 Dhanda, SSingh, JSingh, H Goat brain enkephalin degrading enzyme: interaction with analgesic and antihypertensive drugs Med Chem Res 20:1294-7 (2011)    Article 
Target
Name:
Dipeptidyl peptidase 3
Synonyms:
3.4.14.4 Dipeptidyl peptidase 3 M91_14005
Type:
PROTEIN
Mol. Mass.:
82027.05
Organism:
Bos mutus
Description:
ChEMBL_117383
Residue:
730
  
Inhibitor
Name:
BDBM50174201
Synonyms:
ARTHROTEC SOLARAZE US11173137, Compound Diclofenac VOLTAREN-XR sodium 2-(2-(2,6-dichlorophenylamino)phenyl)acetate
Type:
Small organic molecule
Emp. Form.:
C14H10Cl2NO2
Mol. Mass.:
295.141
SMILES:
[O-]C(=O)Cc1ccccc1Nc1c(Cl)cccc1Cl
: