Target
D(3) dopamine receptor
Ligand
BDBM50020221
Substrate
Meas. Tech.
ChEMBL_62296 (CHEMBL675218)
Ki
0.66±n/a nM
Citation
 Glase, SACorbin, AEPugsley, TAHeffner, TGWise, LD Synthesis and dopaminergic activity of pyridine analogs of 5-hydroxy-2-(di-n-propylamino)tetralin. J Med Chem 38:3132-7 (1995)  
Target
Name:
D(3) dopamine receptor
Synonyms:
DOPAMINE D3 DRD3_HUMAN Dopamine D3 receptor (D3) Dopamine receptor Dopamine receptor D3
Type:
Mol. Mass.:
44243.43
Organism:
Homo sapiens (Human)
Description:
Residue:
400
  
Inhibitor
Name:
BDBM50020221
Synonyms:
(-)-5-hydroxy-2-(dipropylamino)tetralin 5-hydroxy-2-(dipropylamino)tetralin 6-Dipropylamino-5,6,7,8-tetrahydro-naphthalen-1-ol (DP-5-ADTN) | CHEMBL273273
Type:
Small organic molecule
Emp. Form.:
C16H25NO
Mol. Mass.:
247.3758
SMILES:
CCCN(CCC)C1CCc2c(O)cccc2C1
: