Target
Histamine H3 receptor
Ligand
BDBM50410342
Substrate
Meas. Tech.
ChEMBL_931022 (CHEMBL3070470)
Ki
0.450000±n/a nM
Citation
 Guryn, RStaszewski, MWalczy?ski, K Non-imidazole histamine H Med Chem Res 22:3640-3652 (2013)  
Target
Name:
Histamine H3 receptor
Synonyms:
G-protein coupled receptor 97 HH3R HRH3 Histamine H3 receptor (H3) Histamine receptor (H3 and H4)
Type:
G Protein-Coupled Receptor (GPCR)
Mol. Mass.:
48691.47
Organism:
Homo sapiens (Human)
Description:
Binding assays were using CHO cells stably expressing hH3R receptors.
Residue:
445
  
Inhibitor
Name:
BDBM50410342
Synonyms:
CHEMBL195408
Type:
Small organic molecule
Emp. Form.:
C16H18N2O
Mol. Mass.:
254.3269
SMILES:
C[C@@H]1CCCN1CCc1cc2cc(ccc2o1)C#N
: