Target
Histamine H3 receptor
Ligand
BDBM50458224
Substrate
Meas. Tech.
ChEMBL_931021 (CHEMBL3070469)
Ki
4.0±n/a nM
Citation
 Guryn, RStaszewski, MWalczy?ski, K Non-imidazole histamine H Med Chem Res 22:3640-3652 (2013)  
Target
Name:
Histamine H3 receptor
Synonyms:
HH3R Hrh3
Type:
G Protein-Coupled Receptor (GPCR)
Mol. Mass.:
48607.98
Organism:
Rattus norvegicus (rat)
Description:
Residue:
445
  
Inhibitor
Name:
BDBM50458224
Synonyms:
CHEMBL2297871
Type:
Small organic molecule
Emp. Form.:
C18H25NO2
Mol. Mass.:
287.3966
SMILES:
O=C(C1CC1)c1ccc(OCCCN2CCCCC2)cc1
: