Target
Adenosine receptor A2a
Ligand
BDBM50034381
Substrate
Meas. Tech.
ChEMBL_31070 (CHEMBL640430)
Ki
2920±n/a nM
Citation
 Catarzi, DCecchi, LColotta, VFilacchioni, GMartini, CTacchi, PLucacchini, A Tricyclic heteroaromatic systems. Synthesis and A1 and A2a adenosine binding activities of some 1-aryl-1,4-dihydro-3-methyl[1]benzopyrano[2,3-c] pyrazol-4-ones, 1-aryl-4,9-dihydro-3-methyl-1H-pyrazolo[3,4-b]quinolin-4- ones, and 1-aryl-1H-imidazo[4,5-b]quinoxalines. J Med Chem 38:1330-6 (1995)  
Target
Name:
Adenosine receptor A2a
Synonyms:
AA2AR_RAT Adenosine A2 receptor Adenosine Receptors A2a (A2a) Adenosine receptors A2a Rat striatal adenosine A2a receptor
Type:
G Protein-Coupled Receptor (GPCR)
Mol. Mass.:
45015.65
Organism:
Rattus norvegicus (rat)
Description:
Rat A2A receptors expressed in CHO cells.
Residue:
410
  
Inhibitor
Name:
BDBM50034381
Synonyms:
6-Bromo-3-methyl-1-phenyl-1H-chromeno[2,3-c]pyrazol-4-one | CHEMBL27773
Type:
Small organic molecule
Emp. Form.:
C17H11BrN2O2
Mol. Mass.:
355.185
SMILES:
Cc1nn(-c2ccccc2)c2oc3ccc(Br)cc3c(=O)c12
: