Target
Cytochrome P450 3A4/3A5
Ligand
BDBM50490737
Substrate
Meas. Tech.
ChEMBL_942984 (CHEMBL2343820)
IC50
1000±n/a nM
Citation
 Keenan, MAlexander, PWDiao, HBest, WMKhong, AKerfoot, MThompson, RCWhite, KLShackleford, DMRyan, EGregg, ADCharman, SAvon Geldern, TWScandale, IChatelain, E Design, structure-activity relationship and in vivo efficacy of piperazine analogues of fenarimol as inhibitors of Trypanosoma cruzi. Bioorg Med Chem 21:1756-63 (2013)  
Target
Name:
Cytochrome P450 3A4/3A5
Synonyms:
CYP3A-M
Type:
PROTEIN
Mol. Mass.:
Description:
Components:
This complex has 2 components.
Component 1
Name:
Cytochrome P450 3A4
Synonyms:
Albendazole monooxygenase CP3A4_HUMAN CYP3A4 CYPIIIA4 Cytochrome P450 3A4 (CYP3A4) Nifedipine oxidase Taurochenodeoxycholate 6-alpha-hydroxylase
Type:
Enzyme
Mol. Mass.:
57349.57
Organism:
Homo sapiens (Human)
Description:
Residue:
503
  
Component 2
Name:
Cytochrome P450 3A5
Synonyms:
CP3A5_HUMAN Cytochrome P450 3A5 | Cytochrome P450 3A5 (CYP3A5)
Type:
Protein
Mol. Mass.:
57118.00
Organism:
Homo sapiens (Human)
Description:
P20815
Residue:
502
  
Inhibitor
Name:
BDBM50490737
Synonyms:
CHEMBL1863288 | DNDI1538112
Type:
Small organic molecule
Emp. Form.:
C18H19F4N3O2S
Mol. Mass.:
417.421
SMILES:
CS(=O)(=O)N1CCN(CC1)C(c1cccnc1)c1ccc(cc1F)C(F)(F)F
: