Target
Translocator protein
Ligand
BDBM50491012
Substrate
Meas. Tech.
ChEMBL_957539 (CHEMBL2378342)
Ki
0.550000±n/a nM
Citation
 O'Shea, DAhmad, RÅrstad, EAvory, MChau, WFDurrant, CHirani, EJones, PAKhan, ILuthra, SKMantzilas, DMorisson-Iveson, VPassmore, JRobins, EGShan, BWadsworth, HWalton, SZhao, YTrigg, W Exploration of the structure-activity relationship of a novel tetracyclic class of TSPO ligands-potential novel positron emitting tomography imaging agents. Bioorg Med Chem Lett 23:2368-72 (2013)  
Target
Name:
Translocator protein
Synonyms:
Benzodiazepine receptors; peripheral & central Mbr PBR Peripheral benzodiazepine receptor (PBR) TSPO_RAT | Tspo
Type:
Mitochondrion membrane protein
Mol. Mass.:
18945.84
Organism:
Rattus norvegicus (rat)
Description:
Competitive binding experiments were performed on rat kidney mitochondrial membranes.
Residue:
169
  
Inhibitor
Name:
BDBM50491012
Synonyms:
CHEMBL2377333
Type:
Small organic molecule
Emp. Form.:
C22H23FN2O2S
Mol. Mass.:
398.494
SMILES:
CCN(CC)C(=O)C1Sc2ccc(O)cc2-c2c1c1ccccc1n2CCF
: