Target
Cytochrome P450 3A4/3A5
Ligand
BDBM50491622
Substrate
Meas. Tech.
ChEMBL_961637 (CHEMBL2388954)
IC50
>50000±n/a nM
Citation
 Barnes-Seeman, DJain, MBell, LFerreira, SCohen, SChen, XHAmin, JSnodgrass, BHatsis, P Metabolically Stable tert-Butyl Replacement. ACS Med Chem Lett 4:514-6 (2013)  
Target
Name:
Cytochrome P450 3A4/3A5
Synonyms:
CYP3A-M
Type:
PROTEIN
Mol. Mass.:
Description:
Components:
This complex has 2 components.
Component 1
Name:
Cytochrome P450 3A4
Synonyms:
Albendazole monooxygenase CP3A4_HUMAN CYP3A4 CYPIIIA4 Cytochrome P450 3A4 (CYP3A4) Nifedipine oxidase Taurochenodeoxycholate 6-alpha-hydroxylase
Type:
Enzyme
Mol. Mass.:
57349.57
Organism:
Homo sapiens (Human)
Description:
Residue:
503
  
Component 2
Name:
Cytochrome P450 3A5
Synonyms:
CP3A5_HUMAN Cytochrome P450 3A5 | Cytochrome P450 3A5 (CYP3A5)
Type:
Protein
Mol. Mass.:
57118.00
Organism:
Homo sapiens (Human)
Description:
P20815
Residue:
502
  
Inhibitor
Name:
BDBM50491622
Synonyms:
CHEMBL2386156
Type:
Small organic molecule
Emp. Form.:
C17H12F6N2O
Mol. Mass.:
374.2804
SMILES:
FC(F)(F)c1ccc(NC(=O)c2ccc(cc2)C2(CC2)C(F)(F)F)cn1
: