Target
Prostaglandin G/H synthase 2
Ligand
BDBM50057898
Substrate
Meas. Tech.
ChEMBL_963764 (CHEMBL2395763)
IC50
34±n/a nM
Citation
 Battilocchio, CPoce, GAlfonso, SPorretta, GCConsalvi, SSautebin, LPace, SRossi, AGhelardini, CDi Cesare Mannelli, LSchenone, SGiordani, ADi Francesco, LPatrignani, PBiava, M A class of pyrrole derivatives endowed with analgesic/anti-inflammatory activity. Bioorg Med Chem 21:3695-701 (2013)  
Target
Name:
Prostaglandin G/H synthase 2
Synonyms:
Cox-2 Cyclooxygenase-2 Glucocorticoid-regulated inflammatory cyclooxygenase Macrophage activation-associated marker protein P71/73 PGH synthase 2 PGHS-2 Pghs-b Prostaglandin H2 synthase 2 Ptgs2 Tis10
Type:
Protein
Mol. Mass.:
69020.39
Organism:
Mus musculus (Mouse)
Description:
Q05769
Residue:
604
  
Inhibitor
Name:
BDBM50057898
Synonyms:
1-(4-Fluoro-phenyl)-5-(4-methanesulfonyl-phenyl)-2-methyl-1H-pyrrole-3-carbaldehyde | CHEMBL289813
Type:
Small organic molecule
Emp. Form.:
C19H16FNO3S
Mol. Mass.:
357.399
SMILES:
Cc1c(C=O)cc(-c2ccc(cc2)S(C)(=O)=O)n1-c1ccc(F)cc1
: