Target
Cholinesterase
Ligand
BDBM50227193
Substrate
Meas. Tech.
ChEMBL_969869 (CHEMBL2404669)
IC50
>50000±n/a nM
Citation
 Mohamed, TOsman, WTin, GRao, PP Selective inhibition of human acetylcholinesterase by xanthine derivatives: in vitro inhibition and molecular modeling investigations. Bioorg Med Chem Lett 23:4336-41 (2013)  
Target
Name:
Cholinesterase
Synonyms:
Acylcholine acylhydrolase Butyrylcholine esterase (BChE) Butyrylcholinesterase (BuChE) CHLE_HUMAN Cholinesterases Pseudocholinesterase
Type:
Homotetramer
Mol. Mass.:
68422.27
Organism:
Homo sapiens (Human)
Description:
P06276
Residue:
602
  
Inhibitor
Name:
BDBM50227193
Synonyms:
CHEBI:17712 | Xanthine
Type:
Small organic molecule
Emp. Form.:
C5H4N4O2
Mol. Mass.:
152.1109
SMILES:
O=c1[nH]c2[nH]cnc2c(=O)[nH]1
: