Target
Carbonic anhydrase 1
Ligand
BDBM26990
Substrate
Meas. Tech.
ChEMBL_975723 (CHEMBL2415221)
Ki
600±n/a nM
Citation
 Pan, PVermelho, ABScozzafava, AParkkila, SCapasso, CSupuran, CT Anion inhibition studies of the ?-carbonic anhydrase from the protozoan pathogen Trypanosoma cruzi, the causative agent of Chagas disease. Bioorg Med Chem 21:4472-6 (2013)  
Target
Name:
Carbonic anhydrase 1
Synonyms:
CA-I CAB Carbonate dehydratase I Carbonic anhydrase 1 (CA I) Carbonic anhydrase 1 (Recombinant CA I) Carbonic anhydrase B Carbonic anhydrase I (CA I) Carbonic anhydrase I (CAI) Carbonic anhydrase isoenzyme I (hCA I) | hCA
Type:
Enzyme
Mol. Mass.:
28873.37
Organism:
Homo sapiens (Human)
Description:
P00915
Residue:
261
  
Inhibitor
Name:
BDBM26990
Synonyms:
CHEMBL1644699 HS(-1) hydrosulfide | sulfanide
Type:
Ion
Emp. Form.:
HS
Mol. Mass.:
33.073
SMILES:
[SH-]
: