Target
Mu-type opioid receptor
Ligand
BDBM50370595
Substrate
Meas. Tech.
ChEMBL_978259 (CHEMBL2423628)
EC50
500±n/a nM
Citation
 Magnus, PGhavimi, BCoe, JW Access to 7?-analogs of codeine with mixed ?/? agonist activity via 6,7-?-epoxide opening. Bioorg Med Chem Lett 23:4870-4 (2013)  
Target
Name:
Mu-type opioid receptor
Synonyms:
M-OR-1 MOR-1 MUOR1 Mu opiate receptor OPRM1 hMOP | mu-type opioid receptor isoform MOR-1
Type:
G Protein-Coupled Receptor (GPCR)
Mol. Mass.:
44789.51
Organism:
Homo sapiens (Human)
Description:
P35372
Residue:
400
  
Inhibitor
Name:
BDBM50370595
Synonyms:
OXYCODONE US1184575, oxycodone | US9233167, Oxycodone
Type:
Small organic molecule
Emp. Form.:
C18H21NO4
Mol. Mass.:
315.3636
SMILES:
COc1ccc2C[C@H]3N(C)CC[C@@]45[C@@H](Oc1c24)C(=O)CC[C@@]35O
: