Target
Beta-secretase 1
Ligand
BDBM50493650
Substrate
Meas. Tech.
ChEMBL_986999 (CHEMBL2439319)
IC50
7500±n/a nM
Citation
 Yonezawa, SFujiwara, KYamamoto, THattori, KYamakawa, HMuto, CHosono, MTanaka, YNakano, TTakemoto, HArisawa, MShuto, S Conformational restriction approach to ?-secretase (BACE1) inhibitors III: effective investigation of the binding mode by combinational use of X-ray analysis, isothermal titration calorimetry and theoretical calculations. Bioorg Med Chem 21:6506-22 (2013)  
Target
Name:
Beta-secretase 1
Synonyms:
ASP2 Aspartyl protease 2 BACE1 Beta-secretase (BACE) Beta-secretase 1 (BACE 1) Beta-secretase 1 (BACE1) Beta-site amyloid precursor protein cleaving enzyme 1 Memapsin-2 beta-Secretase (BACE-1) | beta-Secretase (BACE1)
Type:
Protein
Mol. Mass.:
55755.10
Organism:
Homo sapiens (Human)
Description:
P56817
Residue:
501
  
Inhibitor
Name:
BDBM50493650
Synonyms:
CHEMBL2437443
Type:
Small organic molecule
Emp. Form.:
C24H26F3N3O4
Mol. Mass.:
477.4761
SMILES:
OC(=O)C(F)(F)F.[H][C@]1(C[C@H]1c1cccc(c1)-c1ccccc1OC)[C@]1(C)CC(=O)N(C)C(N)=N1
: