Target
Kappa-type opioid receptor
Ligand
BDBM50493718
Substrate
Meas. Tech.
ChEMBL_988382 (CHEMBL2437809)
Ki
3.6±n/a nM
Citation
 Loriga, GLazzari, PRuiu, SMarchese, GManca, ICasu, GLDessė, CPinna, GAAsproni, BMurineddu, G Synthesis and biological evaluation of novel delta (?) opioid receptor ligands with diazatricyclodecane skeletons. Eur J Med Chem 69:413-26 (2013)  
Target
Name:
Kappa-type opioid receptor
Synonyms:
KOR-1 OPIATE Kappa Oprk1
Type:
Enzyme
Mol. Mass.:
42656.78
Organism:
Mus musculus (Mouse)
Description:
P33534
Residue:
380
  
Inhibitor
Name:
BDBM50493718
Synonyms:
CHEMBL2436054
Type:
Small organic molecule
Emp. Form.:
C31H39N3O2
Mol. Mass.:
485.6603
SMILES:
Oc1cccc(c1)C(N1C2CCC1C1CCC2N1CC=C)c1ccc(cc1)C(=O)NC1CCCCC1
: