Target
Retinoic acid receptor RXR-alpha
Ligand
BDBM50040016
Substrate
Meas. Tech.
ChEMBL_196482 (CHEMBL798296)
Kd
27±n/a nM
Citation
 Boehm, MFZhang, LBadea, BAWhite, SKMais, DEBerger, ESuto, CMGoldman, MEHeyman, RA Synthesis and structure-activity relationships of novel retinoid X receptor-selective retinoids. J Med Chem 37:2930-41 (1994)  
Target
Name:
Retinoic acid receptor RXR-alpha
Synonyms:
NR2B1 Nuclear receptor subfamily 4 group A member 2 RXRA Retinoic acid receptor RXR-alpha/gamma Retinoid receptor
Type:
PROTEIN
Mol. Mass.:
50820.38
Organism:
Homo sapiens (Human)
Description:
ChEMBL_1456363
Residue:
462
  
Inhibitor
Name:
BDBM50040016
Synonyms:
4-[1-(3-Chloro-5,5,8,8-tetramethyl-5,6,7,8-tetrahydro-naphthalen-2-yl)-vinyl]-benzoic acid | CHEMBL101609
Type:
Small organic molecule
Emp. Form.:
C23H25ClO2
Mol. Mass.:
368.896
SMILES:
CC1(C)CCC(C)(C)c2cc(C(=C)c3ccc(cc3)C(O)=O)c(Cl)cc12
: