Target
Adenosine receptor A3
Ligand
BDBM82053
Substrate
Meas. Tech.
ChEMBL_1278713 (CHEMBL3096087)
Ki
22300±n/a nM
Citation
 Koch, PAkkari, RBrunschweiger, ABorrmann, TSchlenk, MKüppers, PKöse, MRadjainia, HHockemeyer, JDrabczy?ska, AKie?-Kononowicz, KMüller, CE 1,3-Dialkyl-substituted tetrahydropyrimido[1,2-f]purine-2,4-diones as multiple target drugs for the potential treatment of neurodegenerative diseases. Bioorg Med Chem 21:7435-52 (2013)  
Target
Name:
Adenosine receptor A3
Synonyms:
A3 adenosine receptor (hA3) ADORA3 | Adenosine A3 receptor (A3AR)
Type:
G Protein-Coupled Receptor (GPCR)
Mol. Mass.:
36197.32
Organism:
Homo sapiens (Human)
Description:
P0DMS8
Residue:
318
  
Inhibitor
Name:
BDBM82053
Synonyms:
8-(2-Furyl)theophylline US9144538, Theophylline
Type:
Emp. Form.:
C7H8N4O2
Mol. Mass.:
180.164
SMILES:
Cn1c2[nH]cnc2c(=O)n(C)c1=O
: