Target
Aromatase
Ligand
BDBM50041376
Substrate
Meas. Tech.
ChEMBL_50887 (CHEMBL664890)
Ki
1.4±n/a nM
Citation
 Numazawa, MOshibe, M 6-Alkyl- and 6-arylandrost-4-ene-3,17-diones as aromatase inhibitors. Synthesis and structure-activity relationships. J Med Chem 37:1312-9 (1994)  
Target
Name:
Aromatase
Synonyms:
ARO1 CP19A_HUMAN CYP19 CYPXIX Cytochrome P450 19A1 Cytochrome P450-C19 (CYP19) FL cytokine receptor precursor | P-450AROM
Type:
Enzyme
Mol. Mass.:
57888.92
Organism:
Homo sapiens (Human)
Description:
P11511
Residue:
503
  
Inhibitor
Name:
BDBM50041376
Synonyms:
(R)-6-Ethyl-10,13-dimethyl-1,6,7,8,9,10,11,12,13,14,15,16-dodecahydro-2H-cyclopenta[a]phenanthrene-3,17-dione | CHEMBL25059
Type:
Small organic molecule
Emp. Form.:
C21H30O2
Mol. Mass.:
314.4617
SMILES:
CC[C@@H]1CC2C3CCC(=O)C3(C)CCC2C2(C)CCC(=O)C=C12
: