Target
Potassium voltage-gated channel subfamily H member 2
Ligand
BDBM89440
Substrate
Meas. Tech.
ChEMBL_1278259 (CHEMBL3096731)
IC50
50±n/a nM
Citation
 Louvel, JCarvalho, JFYu, ZSoethoudt, MLenselink, EBKlaasse, EBrussee, JIjzerman, AP Removal of human ether-à-go-go related gene (hERG) K+ channel affinity through rigidity: a case of clofilium analogues. J Med Chem 56:9427-40 (2013)  
Target
Name:
Potassium voltage-gated channel subfamily H member 2
Synonyms:
1,3-beta-glucan synthase component GLS2 ERG Eag-related protein 1 Ether-a-go-go-related gene (HERG) Ether-a-go-go-related gene potassium channel 1 Ether-a-go-go-related gene potassium channel 1 (hERG1) Ether-a-go-go-related protein 1 H-ERG KCNH2 Potassium voltage-gated channel subfamily H member 2 (hERG) Voltage-gated potassium channel subunit Kv11.1 hERG Potassium Channel 1 | putative potassium channel subunit
Type:
Multi-pass membrane protein
Mol. Mass.:
126672.65
Organism:
Homo sapiens (Human)
Description:
Q12809
Residue:
1159
  
Inhibitor
Name:
BDBM89440
Synonyms:
4-(4-chlorophenyl)butyl-diethyl-heptyl-ammonium;tosylate 4-(4-chlorophenyl)butyl-diethyl-heptylammonium;4-methylbenzenesulfonate CHEMBL9484 MLS002154263 cid_175533
Type:
Small organic molecule
Emp. Form.:
C21H37ClN
Mol. Mass.:
338.978
SMILES:
CCCCCCC[N+](CC)(CC)CCCCc1ccc(Cl)cc1
: