Target
cAMP and cAMP-inhibited cGMP 3',5'-cyclic phosphodiesterase 10A
Ligand
BDBM50494750
Substrate
Meas. Tech.
ChEMBL_1278436 (CHEMBL3097834)
IC50
9.0±n/a nM
Citation
 Banerjee, ANarayana, LRaje, FAPisal, DVKadam, PAGullapalli, SKumar, HMore, SVBajpai, MSangana, RRJadhav, SGudi, GSKhairatkar-Joshi, NMerugu, RRVoleti, SRGharat, LA Discovery of benzo[d]imidazo[5,1-b]thiazole as a new class of phosphodiesterase 10A inhibitors. Bioorg Med Chem Lett 23:6747-54 (2013)  
Target
Name:
cAMP and cAMP-inhibited cGMP 3',5'-cyclic phosphodiesterase 10A
Synonyms:
3',5'-cyclic phosphodiesterase PDE10_HUMAN Phosphodiesterase 10A
Type:
Protein
Mol. Mass.:
88412.52
Organism:
Homo sapiens (Human)
Description:
Q9Y233
Residue:
779
  
Inhibitor
Name:
BDBM50494750
Synonyms:
CHEMBL3094140
Type:
Small organic molecule
Emp. Form.:
C27H26N4O2S
Mol. Mass.:
470.586
SMILES:
CC(=O)N1CCC(CC1)c1nc(C)c2sc3cc(OCc4ccc5ccccc5n4)ccc3n12
: