Target
cAMP and cAMP-inhibited cGMP 3',5'-cyclic phosphodiesterase 10A
Ligand
BDBM50494759
Substrate
Meas. Tech.
ChEMBL_1278436 (CHEMBL3097834)
IC50
4.9±n/a nM
Citation
 Banerjee, ANarayana, LRaje, FAPisal, DVKadam, PAGullapalli, SKumar, HMore, SVBajpai, MSangana, RRJadhav, SGudi, GSKhairatkar-Joshi, NMerugu, RRVoleti, SRGharat, LA Discovery of benzo[d]imidazo[5,1-b]thiazole as a new class of phosphodiesterase 10A inhibitors. Bioorg Med Chem Lett 23:6747-54 (2013)  
Target
Name:
cAMP and cAMP-inhibited cGMP 3',5'-cyclic phosphodiesterase 10A
Synonyms:
3',5'-cyclic phosphodiesterase PDE10_HUMAN Phosphodiesterase 10A
Type:
Protein
Mol. Mass.:
88412.52
Organism:
Homo sapiens (Human)
Description:
Q9Y233
Residue:
779
  
Inhibitor
Name:
BDBM50494759
Synonyms:
CHEMBL3094141
Type:
Small organic molecule
Emp. Form.:
C25H18N4OS
Mol. Mass.:
422.502
SMILES:
Cc1nc(-c2ccncc2)n2c3ccc(OCc4ccc5ccccc5n4)cc3sc12
: