Target
Polyphenol oxidase 2
Ligand
BDBM50494895
Substrate
Meas. Tech.
ChEMBL_1277452 (CHEMBL3095775)
Ki
120900±n/a nM
Citation
 Kashima, YMiyazawa, M Synthesis, antioxidant capacity, and structure-activity relationships of tri-O-methylnorbergenin analogues on tyrosinase inhibition. Bioorg Med Chem Lett 23:6580-4 (2013)  
Target
Name:
Polyphenol oxidase 2
Synonyms:
Monophenol monooxygenase PPO2 Tyrosinase
Type:
Protein
Mol. Mass.:
63923.66
Organism:
Agaricus bisporus (Common mushroom)
Description:
O42713
Residue:
556
  
Inhibitor
Name:
BDBM50494895
Synonyms:
CHEMBL3092599
Type:
Small organic molecule
Emp. Form.:
C23H24O11
Mol. Mass.:
476.4301
SMILES:
[H][C@]12OC(=O)c3cc(OC)c(OC)c(OC)c3[C@]1([H])O[C@H](COC(=O)c1ccc(O)cc1)[C@@H](O)[C@@H]2O
: