Target
Adenosine receptor A1
Ligand
BDBM50041592
Substrate
Meas. Tech.
ChEMBL_29168 (CHEMBL637899)
Ki
11000±n/a nM
Citation
 Grahner, BWiniwarter, SLanzner, WMüller, CE Synthesis and structure-activity relationships of deazaxanthines: analogs of potent A1- and A2-adenosine receptor antagonists. J Med Chem 37:1526-34 (1994)  
Target
Name:
Adenosine receptor A1
Synonyms:
AA1R_RAT ADENOSINE A1 high Adenosine A1 receptor (A1) Adenosine receptors A1 | Adora1
Type:
Protein
Mol. Mass.:
36704.13
Organism:
Rattus norvegicus (rat)
Description:
Residue:
326
  
Inhibitor
Name:
BDBM50041592
Synonyms:
1,3,7-Trimethyl-6-phenyl-1,7-dihydro-pyrrolo[2,3-d]pyrimidine-2,4-dione | CHEMBL38811
Type:
Small organic molecule
Emp. Form.:
C15H15N3O2
Mol. Mass.:
269.2985
SMILES:
Cn1c(cc2c1n(C)c(=O)n(C)c2=O)-c1ccccc1
: