Target
Cannabinoid receptor 1
Ligand
BDBM50495106
Substrate
Meas. Tech.
ChEMBL_1285979 (CHEMBL3106286)
Ki
0.600000±n/a nM
Citation
 Sharma, RNikas, SPParonis, CAWood, JTHalikhedkar, AGuo, JJThakur, GAKulkarni, SBenchama, ORaghav, JGGifford, RSJärbe, TUBergman, JMakriyannis, A Controlled-deactivation cannabinergic ligands. J Med Chem 56:10142-57 (2013)  
Target
Name:
Cannabinoid receptor 1
Synonyms:
Brain-type cannabinoid receptor CB-R CNR1_RAT Cannabinoid receptor Cnr1 | Skr6
Type:
G Protein-Coupled Receptor (GPCR)
Mol. Mass.:
52856.55
Organism:
Rattus norvegicus (rat)
Description:
P20272
Residue:
473
  
Inhibitor
Name:
BDBM50495106
Synonyms:
CHEMBL3104358 | US10882838, Example 1.16
Type:
Small organic molecule
Emp. Form.:
C23H32O4
Mol. Mass.:
372.4978
SMILES:
[H][C@@]12CC(C)=CC[C@@]1([H])C(C)(C)Oc1cc(cc(O)c21)[C@H](C)C(=O)OCCCC
: