Target
17-beta-hydroxysteroid dehydrogenase type 1
Ligand
BDBM50400509
Substrate
Meas. Tech.
ChEMBL_1287298 (CHEMBL3111006)
IC50
97±n/a nM
Citation
 Maltais, RAyan, DTrottier, ABarbeau, XLagüe, PBouchard, JEPoirier, D Discovery of a non-estrogenic irreversible inhibitor of 17?-hydroxysteroid dehydrogenase type 1 from 3-substituted-16?-(m-carbamoylbenzyl)-estradiol derivatives. J Med Chem 57:204-22 (2014)  
Target
Name:
17-beta-hydroxysteroid dehydrogenase type 1
Synonyms:
17-beta-HSD 1 17-beta-hydroxysteroid dehydrogenase type 1 20-alpha-HSD E17KSR EDH17B1 EDHB17 Estradiol 17-beta-dehydrogenase 1 (17beta-HSD1) Placental 17-beta-hydroxysteroid dehydrogenase | SDR28C1
Type:
Enzyme
Mol. Mass.:
34945.13
Organism:
Homo sapiens (Human)
Description:
P14061
Residue:
328
  
Inhibitor
Name:
BDBM50400509
Synonyms:
CHEMBL2203397
Type:
Small organic molecule
Emp. Form.:
C28H34BrNO2
Mol. Mass.:
496.479
SMILES:
C[C@]12CC[C@H]3[C@@H](CCc4cc(CCBr)ccc34)[C@@H]1C[C@H](Cc1cccc(c1)C(N)=O)[C@@H]2O
: