Target
Thromboxane-A synthase
Ligand
BDBM50017896
Substrate
Meas. Tech.
ChEMBL_207794 (CHEMBL880941)
IC50
200±n/a nM
Citation
 Yamaguchi, MKamei, KKoga, TAkima, MMaruyama, AKuroki, TOhi, N Novel antiasthmatic agents with dual activities of thromboxane A2 synthetase inhibition and bronchodilation. 2. 4-(3-Pyridyl)-1(2H)-phthalazinones. J Med Chem 36:4061-8 (1994)  
Target
Name:
Thromboxane-A synthase
Synonyms:
Cyp5 Cytochrome P450 5A1 TXA synthase Tbxas1
Type:
PROTEIN
Mol. Mass.:
59971.80
Organism:
Rattus norvegicus
Description:
ChEMBL_209768
Residue:
533
  
Inhibitor
Name:
BDBM50017896
Synonyms:
(E)-3-(4-Imidazol-1-ylmethyl-phenyl)-acrylic acid CHEMBL11662 Ozagrel | cid_5282440
Type:
Small organic molecule
Emp. Form.:
C13H12N2O2
Mol. Mass.:
228.2466
SMILES:
OC(=O)\C=C\c1ccc(Cn2ccnc2)cc1
: