Target
Thromboxane-A synthase
Ligand
BDBM50043282
Substrate
Meas. Tech.
ChEMBL_207794 (CHEMBL880941)
IC50
3300±n/a nM
Citation
 Yamaguchi, MKamei, KKoga, TAkima, MMaruyama, AKuroki, TOhi, N Novel antiasthmatic agents with dual activities of thromboxane A2 synthetase inhibition and bronchodilation. 2. 4-(3-Pyridyl)-1(2H)-phthalazinones. J Med Chem 36:4061-8 (1994)  
Target
Name:
Thromboxane-A synthase
Synonyms:
Cyp5 Cytochrome P450 5A1 TXA synthase Tbxas1
Type:
PROTEIN
Mol. Mass.:
59971.80
Organism:
Rattus norvegicus
Description:
ChEMBL_209768
Residue:
533
  
Inhibitor
Name:
BDBM50043282
Synonyms:
2-Methyl-4-thiazol-5-yl-2H-phthalazin-1-one | CHEMBL130453
Type:
Small organic molecule
Emp. Form.:
C12H9N3OS
Mol. Mass.:
243.284
SMILES:
Cn1nc(-c2cncs2)c2ccccc2c1=O
: