Target
Lanosterol 14-alpha demethylase
Ligand
BDBM31768
Substrate
Meas. Tech.
ChEBML_218499
Ki
25±n/a nM
Citation
 Walker, KAKertesz, DJRotstein, DMSwinney, DCBerry, PWSo, OYWebb, ASWatson, DMMak, AYBurton, PM Selective inhibition of mammalian lanosterol 14 alpha-demethylase: a possible strategy for cholesterol lowering. J Med Chem 36:2235-7 (1993)  
Target
Name:
Lanosterol 14-alpha demethylase
Synonyms:
CP51A_HUMAN CYP51A1 Cytochrome P450 51 LDM P450-14DM P450LI Sterol 14-alpha demethylase
Type:
Protein
Mol. Mass.:
56817.21
Organism:
Homo sapiens (Human)
Description:
Q16850
Residue:
503
  
Inhibitor
Name:
BDBM31768
Synonyms:
CHEMBL295698 Nizoral | Panfungol
Type:
Small organic molecule
Emp. Form.:
C26H28Cl2N4O4
Mol. Mass.:
531.431
SMILES:
CC(=O)N1CCN(CC1)c1ccc(OC[C@@H]2CO[C@](Cn3ccnc3)(O2)c2ccc(Cl)cc2Cl)cc1
: