Target
Protease
Ligand
BDBM50497088
Substrate
Meas. Tech.
ChEMBL_1349798 (CHEMBL3267999)
IC50
149±n/a nM
Citation
 Qiu, XZhao, GDTang, LQLiu, ZP Design and synthesis of highly potent HIV-1 protease inhibitors with novel isosorbide-derived P2 ligands. Bioorg Med Chem Lett 24:2465-8 (2014)  
Target
Name:
Protease
Synonyms:
Type:
Enzyme
Mol. Mass.:
10904.79
Organism:
Human immunodeficiency virus 1 (HIV-1)
Description:
Q9YQ12
Residue:
99
  
Inhibitor
Name:
BDBM50497088
Synonyms:
CHEMBL3263089
Type:
Small organic molecule
Emp. Form.:
C28H37N3O11S
Mol. Mass.:
623.672
SMILES:
[H][C@]12OC[C@@H](O[N+]([O-])=O)[C@@]1([H])OC[C@@H]2OC(=O)N[C@@H](Cc1ccccc1)[C@H](O)CN(CC(C)C)S(=O)(=O)c1ccc(OC)cc1
: