Target
Amiloride-sensitive amine oxidase [copper-containing]
Ligand
BDBM50046189
Substrate
Meas. Tech.
ChEBML_53893
IC50
5600±n/a nM
Citation
 Stanek, JCaravatti, GCapraro, HGFuret, PMett, HSchneider, PRegenass, U S-adenosylmethionine decarboxylase inhibitors: new aryl and heteroaryl analogues of methylglyoxal bis(guanylhydrazone). J Med Chem 36:46-54 (1993)  
Target
Name:
Amiloride-sensitive amine oxidase [copper-containing]
Synonyms:
ABP Abp1 Aoc1 Diamine oxidase | Histaminase
Type:
PROTEIN
Mol. Mass.:
85028.72
Organism:
Rattus norvegicus
Description:
ChEMBL_53893
Residue:
746
  
Inhibitor
Name:
BDBM50046189
Synonyms:
(2E)-2-{3-[(Z)-amino(imino)methyl]benzylidene}hydrazinecarboximidamide | CHEMBL151372
Type:
Small organic molecule
Emp. Form.:
C9H12N6
Mol. Mass.:
204.2318
SMILES:
NC(=N)NN=Cc1cccc(c1)C(N)=N
: