Target
Amiloride-sensitive amine oxidase [copper-containing]
Ligand
BDBM50046199
Substrate
Meas. Tech.
ChEBML_53893
IC50
5000±n/a nM
Citation
 Stanek, JCaravatti, GCapraro, HGFuret, PMett, HSchneider, PRegenass, U S-adenosylmethionine decarboxylase inhibitors: new aryl and heteroaryl analogues of methylglyoxal bis(guanylhydrazone). J Med Chem 36:46-54 (1993)  
Target
Name:
Amiloride-sensitive amine oxidase [copper-containing]
Synonyms:
ABP Abp1 Aoc1 Diamine oxidase | Histaminase
Type:
PROTEIN
Mol. Mass.:
85028.72
Organism:
Rattus norvegicus
Description:
ChEMBL_53893
Residue:
746
  
Inhibitor
Name:
BDBM50046199
Synonyms:
(2E)-2-{3-[(E)-amino(butylimino)methyl]benzylidene}hydrazinecarboximidamide | CHEMBL358674
Type:
Small organic molecule
Emp. Form.:
C13H20N6
Mol. Mass.:
260.3381
SMILES:
CCCCN=C(N)c1cccc(C=NNC(N)=N)c1
: