Target
Lanosterol 14-alpha demethylase
Ligand
BDBM50046560
Substrate
Meas. Tech.
ChEMBL_147858 (CHEMBL754770)
IC50
300±n/a nM
Citation
 Frye, LLCusack, KPLeonard, DA 32-Methyl-32-oxylanosterols: dual-action inhibitors of cholesterol biosynthesis. J Med Chem 36:410-6 (1993)  
Target
Name:
Lanosterol 14-alpha demethylase
Synonyms:
CP51A_RAT Cyp51 Cytochrome P450 51 LDM P450-14DM P450LI | Sterol 14-alpha demethylase
Type:
PROTEIN
Mol. Mass.:
56717.47
Organism:
Rattus norvegicus
Description:
ChEMBL_52075
Residue:
503
  
Inhibitor
Name:
BDBM50046560
Synonyms:
17-(1,5-Dimethyl-hexyl)-14-(1-hydroxy-ethyl)-4,4,10,13-tetramethyl-2,3,4,5,6,9,10,11,12,13,14,15,16,17-tetradecahydro-1H-cyclopenta[a]phenanthren-3-ol | CHEMBL133834
Type:
Small organic molecule
Emp. Form.:
C31H54O2
Mol. Mass.:
458.7593
SMILES:
CC(C)CCC[C@@H](C)[C@H]1CC[C@@]2(C(C)O)C3=CCC4C(C)(C)[C@@H](O)CC[C@]4(C)C3CC[C@]12C
: