Target
Integrase
Ligand
BDBM50183273
Substrate
Meas. Tech.
ChEMBL_1499862 (CHEMBL3583194)
IC50
8100±n/a nM
Citation
 Pescatori, LMétifiot, MChung, SMasoaka, TCuzzucoli Crucitti, GMessore, APupo, GMadia, VNSaccoliti, FScipione, LTortorella, SDi Leva, FSCosconati, SMarinelli, LNovellino, ELe Grice, SFPommier, YMarchand, CCosti, RDi Santo, R N-Substituted Quinolinonyl Diketo Acid Derivatives as HIV Integrase Strand Transfer Inhibitors and Their Activity against RNase H Function of Reverse Transcriptase. J Med Chem 58:4610-23 (2015)  
Target
Name:
Integrase
Synonyms:
pol
Type:
PROTEIN
Mol. Mass.:
32203.43
Organism:
Human immunodeficiency virus 1
Description:
ChEMBL_106649
Residue:
288
  
Inhibitor
Name:
BDBM50183273
Synonyms:
(S)-6-(3-chloro-2-fluorobenzyl)-1-(1-hydroxy-3-methylbutan-2-yl)-7-methoxy-4-oxo-1,4-dihydroquinoline-3-carboxylic acid 6-(3-chloro-2-fluorobenzyl)-1-[(1S)-1-(hydroxymethyl)-2-methylpropyl]-7-methoxy-4-oxo-1,4-dihydroquinoline-3-carboxylic acid ELVITEGRAVIR
Type:
Small organic molecule
Emp. Form.:
C23H23ClFNO5
Mol. Mass.:
447.884
SMILES:
COc1cc2n(cc(C(O)=O)c(=O)c2cc1Cc1cccc(Cl)c1F)[C@H](CO)C(C)C
: