Target
Protease
Ligand
BDBM50498523
Substrate
Meas. Tech.
ChEMBL_1511389 (CHEMBL3606514)
Ki
0.001500±n/a nM
Citation
 Ghosh, AKMartyr, CDOsswald, HLSheri, VRKassekert, LAChen, SAgniswamy, JWang, YFHayashi, HAoki, MWeber, ITMitsuya, H Design of HIV-1 Protease Inhibitors with Amino-bis-tetrahydrofuran Derivatives as P2-Ligands to Enhance Backbone-Binding Interactions: Synthesis, Biological Evaluation, and Protein-Ligand X-ray Studies. J Med Chem 58:6994-7006 (2015)  
Target
Name:
Protease
Synonyms:
Type:
Enzyme
Mol. Mass.:
10904.79
Organism:
Human immunodeficiency virus 1 (HIV-1)
Description:
Q9YQ12
Residue:
99
  
Inhibitor
Name:
BDBM50498523
Synonyms:
CHEMBL3605643
Type:
Small organic molecule
Emp. Form.:
C29H41N3O8S
Mol. Mass.:
591.716
SMILES:
[H][C@]12OC[C@H](NC)[C@@]1([H])[C@H](CO2)OC(=O)N[C@@H](Cc1ccccc1)[C@H](O)CN(CC(C)C)S(=O)(=O)c1ccc(OC)cc1
: